{"text_format":"1","workbook":"xlsx","n_sheets":12,"sheets":["Data Entry","AD-3114","AD-3114 (continuation)","AD-3114 Instructions","ECPR_P1","ECPR_P2","ECPR_P3","ECPR_P4","ECPR","ECPR (2)","PAS","data"],"not_rendered":{"charts":0,"images":2,"macros":1,"external_links":0,"defined_names":19,"comments":0,"pivot_tables":0},"unopened":[],"bounds":{"document_bytes":16777216,"sheet_cells":100000,"rows_first":2000,"rows_last":500,"rows_between":2000,"halvings":0,"cell_chars":16384,"cell_head_chars":4096},"cells_cut":0,"cells_raw":0,"read":"whole","date_system":"1900"}

{"sheet":"Data Entry","index":0,"n_rows":167,"n_cols":30,"rows_kept":167,"cut":false,"hidden":false,"merged":[[0,2,0,6],[26,2,26,6],[39,2,39,7],[2,5,2,6],[6,3,6,6],[13,2,13,6],[5,3,5,6],[61,2,61,3],[11,10,17,10],[9,5,9,6],[7,4,8,7],[7,8,7,10],[41,6,43,7],[62,2,62,3],[60,2,60,9],[9,2,9,3],[65,2,68,10],[4,8,6,9],[61,4,63,10],[7,2,8,3],[63,2,63,3],[47,2,47,7],[4,3,4,6]]}
[null,null,"CFAP Payment Calculator and AD-3114 Generator"]
[null,null,null,null,null,null,null,null,null,null,null,null,null,null,null,null,null,null,null,null,null,null,null,null,null,null,"Livestock","Nonspecialty","specialty","Value Loss"]
[null,null,"State:",null,"County:"]
[null,null,null,null,null,null,null,null,null,null,null,null,null,null,null,null,null,null,null,null,null,null,null,null,null,"Dairy","All Other Cattle","Barley, Malting","Almonds","Aquaculture"]
[null,null,"Producer:",null,null,null,null,{"$f":"TODAY()","v":"2020-06-02"},"CFAP Payment Calculator\nVersion 1.2",null,null,null,null,null,null,null,null,null,null,null,null,null,null,null,null,null,"Feeder Cattle:  Less Than 600 Pounds","Canola","Apples","Floriculture"]
[null,null,"Address:",null,null,null,null,null,null,null,null,null,null,null,null,null,null,null,null,null,null,null,null,null,null,null,"Feeder Cattle:  600 Pounds or More","Corn","Artichokes","Nursery"]
{"$rows_left_out":162}
{"sheet":"AD-3114","index":1,"n_rows":71,"n_cols":24,"rows_kept":71,"cut":false,"hidden":false,"merged":[[51,14,51,23],[52,14,52,19],[53,11,53,13],[54,11,54,13],[53,14,53,19],[54,14,54,19],[51,0,51,13],[53,20,53,23],[52,11,52,13],[54,0,54,4],[54,5,54,10],[54,20,54,23],[52,0,52,4],[52,5,52,10],[52,20,52,23],[53,0,53,4],[53,5,53,10],[24,3,24,23],[25,3,25,23],[26,1,26,23],[46,0,46,4],[46,13,46,15],[46,16,46,22],[43,0,43,23],[42,0,42,4],[42,5,42,10],[42,11,42,12],[41,0,41,4],[41,5,41,10],[41,11,41,12],[41,13,41,15],[41,16,41,21],[41,22,41,23],[70,0,70,23],[69,0,69,3],[69,4,69,13],[69,14,69,16],[69,18,69,22],[42,13,42,15],[42,16,42,21],[42,22,42,23],[55,0,55,13],[55,14,55,23],[6,13,6,18],[6,19,6,23],[29,0,29,22],[30,0,30,22],[31,0,31,22],[68,0,68,3],[68,4,68,13],[68,14,68,16],[68,18,68,22],[64,0,64,23],[65,0,65,10],[65,11,65,20],[65,21,65,23],[66,0,66,23],[67,0,67,3],[67,4,67,13],[67,14,67,16],[67,17,67,23],[60,0,60,23],[61,0,61,23],[63,0,63,23],[62,11,62,15],[62,8,62,9],[62,1,62,7],[62,17,62,21],[62,22,62,23],[58,18,58,22],[59,0,59,2],[59,3,59,5],[59,6,59,9],[59,10,59,11],[59,18,59,22],[58,0,58,2],[58,3,58,5],[58,6,58,9],[58,10,58,11],[58,12,58,13],[59,12,59,13],[58,14,58,17],[59,14,59,17],[56,18,56,22],[57,0,57,2],[57,3,57,5],[57,6,57,9],[57,10,57,11],[57,18,57,22],[56,0,56,2],[56,3,56,5],[56,6,56,9],[56,10,56,11],[56,12,56,13],[57,12,57,13],[56,14,56,17],[57,14,57,17],[50,0,50,4],[50,13,50,15],[48,0,48,4],[48,13,48,15],[49,0,49,4],[49,13,49,15],[48,5,48,8],[49,5,49,8],[50,5,50,8],[48,9,48,12],[49,9,49,12],[50,9,50,12],[36,2,36,4],[36,5,36,10],[36,11,36,12],[40,0,40,4],[40,5,40,10],[40,11,40,12],[36,13,36,15],[36,16,36,21],[47,0,47,4],[47,13,47,15],[47,16,47,22],[47,5,47,8],[44,0,44,15],[44,16,44,23],[45,0,45,4],[45,13,45,15],[45,16,45,22],[46,5,46,8],[45,5,45,8],[45,10,45,12],[46,10,46,12],[47,9,47,12],[35,22,35,23],[35,0,35,1],[35,2,35,4],[35,5,35,10],[35,11,35,12],[35,13,35,15],[35,16,35,21],[40,22,40,23],[39,0,39,4],[39,5,39,10],[39,11,39,12],[39,13,39,15],[39,16,39,21],[39,22,39,23],[40,13,40,15],[40,16,40,21],[36,22,36,23],[37,0,37,15],[37,16,37,23],[38,0,38,4],[38,5,38,10],[38,11,38,12],[38,13,38,15],[38,16,38,21],[38,22,38,23],[36,0,36,1],[33,22,33,23],[34,0,34,1],[34,2,34,4],[34,5,34,10],[34,11,34,12],[34,13,34,15],[34,16,34,21],[34,22,34,23],[33,0,33,1],[33,2,33,4],[7,1,7,23],[4,1,6,10],[33,5,33,10],[33,11,33,12],[33,13,33,15],[33,16,33,21],[27,0,27,23],[28,0,28,23],[32,0,32,12],[32,13,32,23],[18,3,18,23],[21,3,21,23],[22,3,22,23],[19,1,19,23],[20,1,20,23],[10,1,10,23],[11,1,11,23],[23,3,23,23],[1,0,1,23],[2,0,2,12],[2,13,2,18],[2,19,2,23],[3,0,3,12],[3,13,3,18],[9,0,9,23],[16,3,16,23],[17,3,17,23],[3,19,3,23],[8,0,8,23],[15,3,15,23],[12,1,12,23],[13,1,13,23],[14,1,14,23],[4,13,4,18],[4,19,4,23],[5,13,5,18],[5,19,5,23]]}
[null,null,null,null,null,null,null,null,null,null,null,null,null,null,null,null,null,null,null,null,null,null,null,"Form Approved - OMB No. 0560-0295"]
["This form is available electronically.                                                                                                                        OMB  Expiration date 11/30/2020"]
["AD-3114            U.S. DEPARTMENT OF AGRICULTURE",null,null,null,null,null,null,null,null,null,null,null,null,"1.   Recording State",null,null,null,null,null,"2.  Program Year"]
["2020-05-19",null,null,null,null,null,null,null,null,null,null,null,null,{"$f":"IF('Data Entry'!D3=\"\",\"\",'Data Entry'!D3)","v":""},null,null,null,null,null,2020]
[null,"CORONAVIRUS FOOD ASSISTANCE PROGRAM (CFAP) APPLICATION"]
[null,null,null,null,null,null,null,null,null,null,null,null,null,"3.  Recording County",null,null,null,null,null,"4. Application Number"]
{"$rows_left_out":66}
{"sheet":"AD-3114 (continuation)","index":2,"n_rows":51,"n_cols":22,"rows_kept":51,"cut":false,"hidden":false,"merged":[[42,13,42,15],[43,13,43,15],[44,13,44,15],[45,13,45,15],[42,0,42,2],[43,0,43,2],[44,0,44,2],[45,0,45,2],[42,3,42,4],[43,3,43,4],[44,3,44,4],[45,3,45,4],[42,5,42,8],[43,5,43,8],[44,5,44,8],[45,5,45,8],[47,11,47,12],[40,9,40,10],[41,9,41,10],[46,9,46,10],[47,9,47,10],[40,3,40,4],[41,3,41,4],[46,3,46,4],[47,3,47,4],[40,5,40,8],[41,5,41,8],[46,5,46,8],[47,5,47,8],[42,9,42,10],[43,9,43,10],[44,9,44,10],[45,9,45,10],[42,11,42,12],[43,11,43,12],[44,11,44,12],[45,11,45,12],[3,0,5,10],[3,11,3,16],[6,1,6,21],[7,0,7,21],[8,0,8,21],[9,0,9,20],[3,17,3,21],[4,11,4,16],[4,17,4,21],[5,11,5,16],[5,17,5,21],[0,0,0,21],[1,0,1,10],[1,11,1,16],[1,17,1,21],[2,0,2,10],[2,11,2,16],[2,17,2,21],[12,0,12,13],[12,14,12,21],[13,0,13,4],[13,5,13,8],[13,9,13,10],[13,11,13,13],[13,14,13,19],[13,20,13,21],[10,0,10,20],[11,0,11,20],[17,0,17,4],[17,9,17,10],[17,11,17,13],[17,14,17,19],[17,20,17,21],[16,0,16,4],[16,9,16,10],[16,11,16,13],[16,14,16,19],[16,20,16,21],[14,5,17,8],[15,0,15,4],[15,9,15,10],[15,11,15,13],[15,14,15,19],[15,20,15,21],[14,0,14,4],[14,9,14,10],[14,11,14,13],[14,14,14,19],[14,20,14,21],[18,20,18,21],[23,0,23,4],[23,5,23,8],[23,9,23,10],[23,11,23,13],[22,0,22,4],[22,5,22,8],[22,9,22,10],[22,11,22,13],[19,0,19,4],[19,5,19,8],[19,9,19,10],[19,11,19,13],[21,9,21,10],[21,11,21,13],[18,0,18,4],[18,5,18,8],[18,9,18,10],[18,11,18,13],[18,14,18,19],[20,9,20,10],[20,11,20,13],[26,14,26,20],[27,0,27,4],[27,5,27,8],[27,9,27,10],[27,11,27,13],[27,14,27,20],[26,0,26,4],[26,5,26,8],[26,9,26,10],[26,11,26,13],[29,9,29,10],[28,11,28,13],[29,11,29,13],[24,0,24,13],[24,14,24,21],[25,0,25,4],[25,5,25,8],[25,9,25,10],[25,11,25,13],[25,14,25,20],[32,11,32,13],[28,0,28,4],[29,0,29,4],[30,0,30,4],[30,5,30,8],[30,9,30,10],[30,11,30,13],[28,5,28,8],[29,5,29,8],[28,9,28,10],[34,5,34,9],[33,0,33,12],[33,13,33,21],[31,0,31,4],[31,5,31,8],[31,9,31,10],[31,11,31,13],[32,0,32,4],[32,5,32,8],[32,9,32,10],[37,5,37,9],[37,18,37,21],[38,0,38,21],[34,0,34,4],[34,13,34,17],[34,18,34,21],[35,0,35,4],[35,13,35,17],[35,18,35,21],[36,0,36,4],[48,0,48,21],[49,0,49,21],[50,0,50,21],[20,0,20,4],[21,0,21,4],[20,5,20,8],[21,5,21,8],[47,0,47,2],[47,13,47,15],[35,10,35,12],[39,0,39,12],[39,13,39,21],[40,0,40,2],[40,13,40,15],[40,16,40,20],[34,10,34,12],[36,10,36,12],[37,10,37,12],[35,5,35,9],[36,5,36,9],[40,11,40,12],[41,11,41,12],[46,11,46,12],[37,0,37,4],[37,13,37,17],[41,16,41,20],[46,0,46,2],[46,13,46,15],[41,0,41,2],[41,13,41,15]]}
["                                                                                                                                                                                                              Form Approved - OMB No. 0560-0295\nThis form is available electronically.                                                                                                                                                              OMB Expiration date (5-19-20)"]
["AD-3114-A                                  U.S. DEPARTMENT OF AGRICULTURE",null,null,null,null,null,null,null,null,null,null,"1.   Recording State",null,null,null,null,null,"2.  Program Year"]
["(5-19-20)",null,null,null,null,null,null,null,null,null,null,{"$f":"IF('Data Entry'!D3=\"\",\"\",'Data Entry'!D3)","v":""},null,null,null,null,null,2020]
["CORONAVIRUS FOOD ASSISTANCE PROGRAM (CFAP) APPLICATION\n(Continuation Sheet)"]
[null,null,null,null,null,null,null,null,null,null,null,"3.  Recording County",null,null,null,null,null,"4. Application Number"]
[null,null,null,null,null,null,null,null,null,null,null,{"$f":"IF('Data Entry'!F3=\"\",\"\",'Data Entry'!F3)","v":""}]
{"$rows_left_out":46}
{"sheet":"AD-3114 Instructions","index":3,"n_rows":62,"n_cols":3,"rows_kept":62,"cut":false,"hidden":false,"merged":[[0,1,0,2],[8,1,8,2],[7,1,7,2],[11,1,11,2],[19,1,19,2],[26,1,26,2],[41,1,41,2],[1,1,1,2],[27,1,35,1],[47,1,47,2],[56,1,56,2],[58,1,58,2],[9,1,9,2]]}
[null,"AD-3114 Instructions"]
[null,"Note:  Upon completion, only enter the applicants share of the commodity "]
[null,"Item","Instructions"]
[null,1,"Enter the producer’s recording state."]
[null,2,"Enter the applicable program year. "]
[null,3,"Enter the producer’s recording county."]
{"$rows_left_out":57}
{"sheet":"ECPR_P1","index":4,"n_rows":39,"n_cols":15,"rows_kept":39,"cut":false,"hidden":true,"merged":[[1,11,1,12],[1,4,1,10],[2,3,2,5],[2,1,2,2],[32,2,32,3],[1,2,1,3],[13,1,13,2],[10,1,12,9],[4,14,13,14],[33,1,37,1],[33,2,33,3],[34,2,34,3],[35,2,35,3],[36,2,36,3],[37,2,37,3]]}
[]
[null,"Producer Name:",{"$f":"IF('Data Entry'!D5=\"\",\"\",'Data Entry'!D5)","v":""},null,{"$f":"'Data Entry'!E8","v":"100% of the estimated gross payment before reduction is $0.  Your payment may not exceed $250,000, except if you are a corporation, limited liability company or limited partnership and 2 or 3 members each contribute 400 hours of labor and/or management, then your payment limit is $500,000 or $750,000, respectively.  You will receive an initial payment of 80% of the gross payment, not to exceed 80% of the payment limit. Subsequent payments may be issued at a later date."},null,null,null,null,null,null,{"$f":"'Data Entry'!I9","v":0}]
[null,"Recording County:",null,{"$f":"IF(OR('Data Entry'!D3=\"\",'Data Entry'!F3=\"\"),\"\",'Data Entry'!F3&\", County \"&'Data Entry'!D3)","v":""}]
[null,"Category","Commodity Name","Unit of Measure","7)\nJan.  Prod.","8) \nFeb.  Prod.","9)\nMarch  Prod.","2019 Total  Prod. \n","CARES  Payment Rate\n(per pound)","80%\nEstimated CARES Gross Payment  before payment limits and other reductions\n(H*I*80%)","Quarter 2 National Adjustment","CCC Payment Rate\n(per pound)","80%\nEstimated CCC Gross Payment before payment limits and other reductions\n(K*L*M* 80%)",null,"Category"]
["Milk",{"$f":"ECPR!B7","v":"Dairy"},{"$f":"ECPR!C7","v":"Milk"},{"$f":"ECPR!D7","v":"pounds"},{"$f":"ECPR!E7","v":""},{"$f":"ECPR!F7","v":""},{"$f":"ECPR!G7","v":""},{"$f":"ECPR!H7","v":0},{"$f":"ECPR!I7","v":""},{"$f":"ECPR!J7","v":0},{"$f":"ECPR!L7","v":1.014},{"$f":"ECPR!M7","v":""},{"$f":"ECPR!N7","v":0},{"$f":"\"Row Crop \"&#REF!","v":{"$error":"#REF!"}},"Non-specialty crops and wool"]
[null,null,null,null,null,null,null,null,null,{"$f":"J5","v":0},null,null,{"$f":"M5","v":0},{"$f":"\"Row Crop \"&#REF!","v":{"$error":"#REF!"}}]
{"$rows_left_out":34}
{"sheet":"ECPR_P2","index":5,"n_rows":43,"n_cols":15,"rows_kept":43,"cut":false,"hidden":true,"merged":[[36,2,36,3],[37,1,41,1],[37,2,37,3],[38,2,38,3],[39,2,39,3],[40,2,40,3],[41,2,41,3],[1,2,1,3],[1,4,1,10],[1,11,1,12],[4,1,13,1],[19,1,20,2],[2,1,2,2],[2,3,2,5],[15,1,17,9]]}
[]
[null,"Producer Name:",{"$f":"IF('Data Entry'!D5=\"\",\"\",'Data Entry'!D5)","v":""},null,{"$f":"'Data Entry'!E8","v":"100% of the estimated gross payment before reduction is $0.  Your payment may not exceed $250,000, except if you are a corporation, limited liability company or limited partnership and 2 or 3 members each contribute 400 hours of labor and/or management, then your payment limit is $500,000 or $750,000, respectively.  You will receive an initial payment of 80% of the gross payment, not to exceed 80% of the payment limit. Subsequent payments may be issued at a later date."},null,null,null,null,null,null,{"$f":"'Data Entry'!I9","v":0}]
[null,"Recording County:",null,{"$f":"IF(OR('Data Entry'!D3=\"\",'Data Entry'!F3=\"\"),\"\",'Data Entry'!F3&\", County \"&'Data Entry'!D3)","v":""}]
[null,"Category","Commodity Name","Unit of Measure","15) \n2019 Total Prod","16) \n 2019  Prod Not Sold","Smaller of Total of Production or  Production  ((E *50%) or F])","CARES - Quantity Factor (Part 1)","CARES Payment Quantity \n(G*H)","CARES Payment Rate\n(Part 1)","80%\nEstimated CARES Gross Payment before payment limits and other reductions    \n (I*J *80%)","CCC - Quantity Factor          (Part 2)","CCC Payment Quantity ","CCC  Payment Rate\n(Part 2)","80%\nEstimated CCC Gross Payment before payment limits and other reductions"]
[{"$f":"\"Row Crop \"&C5","v":"Row Crop "},{"$f":"ECPR!B11","v":"Non-specialty crops and wool"},{"$f":"ECPR!C11","v":""},{"$f":"ECPR!D11","v":""},{"$f":"ECPR!E11","v":""},{"$f":"ECPR!F11","v":""},{"$f":"ECPR!G11","v":""},{"$f":"ECPR!H11","v":""},{"$f":"ECPR!I11","v":""},{"$f":"ECPR!J11","v":""},{"$f":"ECPR!K11","v":0},{"$f":"ECPR!L11","v":""},{"$f":"ECPR!M11","v":""},{"$f":"ECPR!N11","v":""},{"$f":"ECPR!O11","v":0}]
[{"$f":"\"Row Crop \"&C6","v":"Row Crop "},null,{"$f":"ECPR!C12","v":""},{"$f":"ECPR!D12","v":""},{"$f":"ECPR!E12","v":""},{"$f":"ECPR!F12","v":""},{"$f":"ECPR!G12","v":""},{"$f":"ECPR!H12","v":""},{"$f":"ECPR!I12","v":""},{"$f":"ECPR!J12","v":""},{"$f":"ECPR!K12","v":0},{"$f":"ECPR!L12","v":""},{"$f":"ECPR!M12","v":""},{"$f":"ECPR!N12","v":""},{"$f":"ECPR!O12","v":0}]
{"$rows_left_out":38}
{"sheet":"ECPR_P3","index":6,"n_rows":31,"n_cols":11,"rows_kept":31,"cut":false,"hidden":true,"merged":[[19,1,19,2],[12,9,12,10],[13,9,13,10],[14,9,14,10],[15,0,17,8],[1,4,1,8],[3,9,3,10],[4,9,4,10],[5,9,5,10],[6,9,6,10],[1,2,1,3],[1,9,1,10],[2,1,2,2],[2,3,2,5],[10,9,10,10],[11,9,11,10],[8,9,8,10],[9,9,9,10],[4,1,13,1],[7,9,7,10]]}
[]
[null,"Producer Name:",{"$f":"IF('Data Entry'!D5=\"\",\"\",'Data Entry'!D5)","v":""},null,{"$f":"'Data Entry'!E8","v":"100% of the estimated gross payment before reduction is $0.  Your payment may not exceed $250,000, except if you are a corporation, limited liability company or limited partnership and 2 or 3 members each contribute 400 hours of labor and/or management, then your payment limit is $500,000 or $750,000, respectively.  You will receive an initial payment of 80% of the gross payment, not to exceed 80% of the payment limit. Subsequent payments may be issued at a later date."},null,null,null,null,{"$f":"'Data Entry'!I9","v":0}]
[null,"Recording County:",null,{"$f":"IF(OR('Data Entry'!D3=\"\",'Data Entry'!F3=\"\"),\"\",'Data Entry'!F3&\", County \"&'Data Entry'!D3)","v":""}]
[null,"Category","Livestock","Unit of Measure","21)\nJan 15, 2020 – April 15, 2020 Sales of Owned Invetnory as of Jan 15, 2020 and any Offspirng from Owned Inventory","CARES Payment Rate\n(Part 1)","80%\nEstimated CARES Gross Payment  before payment limits and other reductions","22)\n Inventory\n(Highest Between\n April 16, 2020 -  May 14, 2020","CCC Payment Rate\n(Part 2)","80%\nEstimated CCC Gross Payment  before payment limits and other reductions"]
[{"$f":"\"Row Crop \"&#REF!","v":{"$error":"#REF!"}},{"$f":"ECPR!B24","v":"Livestock"},{"$f":"ECPR!C24","v":""},{"$f":"ECPR!D24","v":""},{"$f":"ECPR!E24","v":""},{"$f":"ECPR!F24","v":""},{"$f":"ECPR!G24","v":0},{"$f":"ECPR!H24","v":""},{"$f":"ECPR!I24","v":""},{"$f":"ECPR!J24","v":0}]
[{"$f":"\"Row Crop \"&#REF!","v":{"$error":"#REF!"}},null,{"$f":"ECPR!C25","v":""},{"$f":"ECPR!D25","v":""},{"$f":"ECPR!E25","v":""},{"$f":"ECPR!F25","v":""},{"$f":"ECPR!G25","v":0},{"$f":"ECPR!H25","v":""},{"$f":"ECPR!I25","v":""},{"$f":"ECPR!J25","v":0}]
{"$rows_left_out":26}
{"sheet":"ECPR_P4","index":7,"n_rows":44,"n_cols":16,"rows_kept":44,"cut":false,"hidden":true,"merged":[[1,12,1,13],[2,1,2,2],[2,3,2,5],[1,4,1,11],[4,1,14,1],[21,1,21,2],[37,2,37,3],[1,2,1,3],[38,1,42,1],[38,2,38,3],[39,2,39,3],[40,2,40,3],[41,2,41,3],[42,2,42,3],[16,1,18,9]]}
[]
[null,"Producer Name:",{"$f":"IF('Data Entry'!D5=\"\",\"\",'Data Entry'!D5)","v":""},null,{"$f":"'Data Entry'!E8","v":"100% of the estimated gross payment before reduction is $0.  Your payment may not exceed $250,000, except if you are a corporation, limited liability company or limited partnership and 2 or 3 members each contribute 400 hours of labor and/or management, then your payment limit is $500,000 or $750,000, respectively.  You will receive an initial payment of 80% of the gross payment, not to exceed 80% of the payment limit. Subsequent payments may be issued at a later date."},null,null,null,null,null,null,null,{"$f":"'Data Entry'!I9","v":0}]
[null,"Recording County:",null,{"$f":"IF(OR('Data Entry'!D3=\"\",'Data Entry'!F3=\"\"),\"\",'Data Entry'!F3&\", County \"&'Data Entry'!D3)","v":""}]
[null,"Category","Commodity","Unit of Measure","Item 32)\nVolume of Production Sold \n(Jan 15, 2020 - April 15, 2020)","CARES - Quantity %","CARES Payment Quantity","CARES  Payment Rate","80%\nEstimated CARES Gross Payment before payment limits and other reductions","33)\nVolume of Production Shipped but Not Sold and Unpaid (Jan 15, 2020 -April\n15, 2020)","CARES  Payment Rate","80%\nEstimated CARES Gross Payment before payment limits and other reductions\n","34)\nAcres with Production Not Shipped or Sold \n(Jan 15, 2020 -April 15)","CCC Payment Quantity (Production per acre from AMS multiplied by item X (application))","CCC  Payment Rate","80% Estimated CCC Gross Payment before payment limits and other reductions"]
[{"$f":"$B$5&\" \"&C5","v":"Specialty crops "},{"$f":"ECPR!B44","v":"Specialty crops"},{"$f":"ECPR!C44","v":""},{"$f":"ECPR!D44","v":""},{"$f":"IF('Data Entry'!E50=\"\",\"\",'Data Entry'!E50)","v":""},{"$f":"IF(C5=\"\",\"\",VLOOKUP(A5,PAS!$A$4:$L$202,10,FALSE))","v":""},{"$f":"IF(E5=\"\",\"\",ROUND(E5*F5,0))","v":""},{"$f":"ECPR!H44","v":""},{"$f":"IF(OR(D5=\"\",C5=\"\",E5=\"\"),0,ROUND(G5*H5*0.8,2))","v":0},{"$f":"IF('Data Entry'!F50=\"\",\"\",'Data Entry'!F50)","v":""},{"$f":"ECPR!K44","v":""},{"$f":"IF(OR(J5=\"\",K5=\"\"),0,ROUND(J5*K5*0.8,2))","v":0},{"$f":"IF('Data Entry'!G50=\"\",\"\",'Data Entry'!G50)","v":""},{"$f":"ECPR!F57","v":""},{"$f":"ECPR!G57","v":""},{"$f":"IF(OR(N5=\"\",O5=\"\"),0,ROUND(N5*O5*0.8,2))","v":0}]
["Specialty crops ",null,{"$f":"ECPR!C45","v":""},{"$f":"ECPR!D45","v":""},{"$f":"IF('Data Entry'!E51=\"\",\"\",'Data Entry'!E51)","v":""},{"$f":"IF(C6=\"\",\"\",VLOOKUP(A6,PAS!$A$4:$L$202,10,FALSE))","v":""},{"$f":"IF(E6=\"\",\"\",ROUND(E6*F6,0))","v":""},{"$f":"ECPR!H45","v":""},{"$f":"IF(OR(D6=\"\",C6=\"\",E6=\"\"),0,ROUND(G6*H6*0.8,2))","v":0},{"$f":"IF('Data Entry'!F51=\"\",\"\",'Data Entry'!F51)","v":""},{"$f":"ECPR!K45","v":""},{"$f":"IF(OR(J6=\"\",K6=\"\"),0,ROUND(J6*K6*0.8,2))","v":0},{"$f":"IF('Data Entry'!G51=\"\",\"\",'Data Entry'!G51)","v":""},{"$f":"ECPR!F58","v":""},{"$f":"ECPR!G58","v":""},{"$f":"IF(OR(N6=\"\",O6=\"\"),0,ROUND(N6*O6*0.8,2))","v":0}]
{"$rows_left_out":39}
{"sheet":"ECPR","index":8,"n_rows":284,"n_cols":20,"rows_kept":284,"cut":false,"hidden":false,"merged":[[1,10,3,11],[1,5,3,9],[67,1,68,7],[1,12,1,13],[2,2,2,3],[56,1,65,1],[35,2,35,3],[36,2,36,3],[37,2,37,3],[35,1,39,1],[1,2,1,3],[10,1,19,1],[23,1,32,1],[43,1,52,1],[34,2,34,3],[38,2,38,3],[39,2,39,3]]}
[]
[null,"Producer Name:",{"$f":"IF('Data Entry'!D5=\"\",\"\",'Data Entry'!D5)","v":""},null,null,{"$f":"'Data Entry'!E8","v":"100% of the estimated gross payment before reduction is $0.  Your payment may not exceed $250,000, except if you are a corporation, limited liability company or limited partnership and 2 or 3 members each contribute 400 hours of labor and/or management, then your payment limit is $500,000 or $750,000, respectively.  You will receive an initial payment of 80% of the gross payment, not to exceed 80% of the payment limit. Subsequent payments may be issued at a later date."},null,null,null,null,{"$f":"'Data Entry'!I9","v":0},null,{"$f":"'Data Entry'!I5","v":"CFAP Payment Calculator\nVersion 1.2"}]
[null,"Recording County:",{"$f":"IF(OR('Data Entry'!D3=\"\",'Data Entry'!F3=\"\"),\"\",'Data Entry'!F3&\", County \"&'Data Entry'!D3)","v":""}]
[]
[null,null,null,null,null,null,null,null,null,null,null,"Date",{"$f":"TODAY()","v":"2020-06-02"}]
[null,"Category","Commodity Name","Unit of Measure","7)\nJan.  Prod.","8) \nFeb.  Prod.","9)\nMarch  Prod.","2019 Total  Prod. \n","CARES  Payment Rate\n(per pound)","80%\nEstimated CARES Gross Payment  before payment limits and other reductions\n(H*I*80%)","Total  Production","Quarter 2 National Adjustment","CCC Payment Rate\n(per pound)","80%\nEstimated CCC Gross Payment before payment limits and other reductions\n(K*L*M* 80%)"]
{"$rows_left_out":279}
{"sheet":"ECPR (2)","index":9,"n_rows":66,"n_cols":18,"rows_kept":66,"cut":false,"hidden":true,"merged":[[1,7,1,9],[1,10,1,11],[1,12,1,13],[41,1,50,1],[54,1,63,1],[8,1,17,1],[1,2,1,3],[1,5,1,6],[65,1,66,9],[21,1,30,1],[32,2,32,3],[33,1,37,1],[33,2,33,3],[34,2,34,3],[35,2,35,3],[36,2,36,3],[37,2,37,3]]}
[]
[null,"Producer Name:",{"$f":"IF('Data Entry'!D5=\"\",\"\",'Data Entry'!D5)","v":""},null,"Recording County:",{"$f":"IF(OR('Data Entry'!D3=\"\",'Data Entry'!F3=\"\"),\"\",'Data Entry'!F3&\", County \"&'Data Entry'!D3)","v":""},null,{"$f":"'Data Entry'!E8","v":"100% of the estimated gross payment before reduction is $0.  Your payment may not exceed $250,000, except if you are a corporation, limited liability company or limited partnership and 2 or 3 members each contribute 400 hours of labor and/or management, then your payment limit is $500,000 or $750,000, respectively.  You will receive an initial payment of 80% of the gross payment, not to exceed 80% of the payment limit. Subsequent payments may be issued at a later date."},null,null,{"$f":"'Data Entry'!I9","v":0},null,{"$f":"'Data Entry'!I5","v":"CFAP Payment Calculator\nVersion 1.2"}]
[null,null,null,null,null,null,null,null,null,null,null,"Date",{"$f":"TODAY()","v":"2020-06-02"}]
[null,"Category","Commodity Name","Unit of Measure","7)\nJan.  Prod.","8) \nFeb.  Prod.","9)\nMarch  Prod.","2019 Total  Prod. \n","CARES  Payment Rate\n(per pound)","Estimated CARES Gross Payment  before payment limits and other reductions\n(H*I)","Total  Production","Quarter 2 National Adjustment","CCC Payment Rate\n(per pound)","Estimated CCC Gross Payment before payment limits and other reductions\n(K*L*M)",null,null,null,{"$f":"J6+N6+O19+K19+J32+G32+I52+L52+H65","v":0}]
["Milk","Dairy","Milk",{"$f":"ECPR!D7","v":"pounds"},{"$f":"IF('Data Entry'!D12=\"\",\"\",'Data Entry'!D12)","v":""},{"$f":"IF('Data Entry'!E12=\"\",\"\",'Data Entry'!E12)","v":""},{"$f":"IF('Data Entry'!F12=\"\",\"\",'Data Entry'!F12)","v":""},{"$f":"SUM(E5:G5)","v":0},{"$f":"ECPR!I7","v":""},{"$f":"IF(OR(H5=\"\",I5=\"\"),0,ROUND(H5*I5,2))","v":0},{"$f":"H5","v":0},1.014,{"$f":"ECPR!M7","v":""},{"$f":"IF(OR(H5=\"\",M5=\"\"),0,ROUND(K5*M5*L5,2))","v":0}]
[null,null,null,null,null,null,null,null,null,{"$f":"J5","v":0},null,null,null,{"$f":"N5","v":0}]
{"$rows_left_out":61}
{"sheet":"PAS","index":10,"n_rows":277,"n_cols":19,"rows_kept":277,"cut":false,"hidden":true,"merged":[]}
[null,"Program Administration System"]
[1,2,3,4,5,6,7,8,9,10,11,12,13,14,15]
[null,"Category","Name","Type","Intended Use","Unit of Measure","Part 1 - Rate","Part 2 - Rate","Part 1 - Payment %","Part 1 - Quantity %","Part 2 - Payment %","Part 2 - Quantity %","Part 3 Quanitity","Price 3","Yield","pmt 1","pmt 2","pmt 3"]
["Livestock All Other Cattle","Livestock","All Other Cattle",null,null,"Head",102,33,0.8,1,0.25,1,null,0,null,"Yes","Yes","No"]
["Livestock Feeder Cattle:  600 Pounds or More","Livestock","Feeder Cattle:  600 Pounds or More",">600 Pounds",null,"Head",139,33,0.8,1,0.25,1,null,0,null,"Yes","Yes","No"]
["Livestock Feeder Cattle:  Less Than 600 Pounds","Livestock","Feeder Cattle:  Less Than 600 Pounds","<600 Pounds",null,"Head",102,33,0.8,1,0.25,1,null,0,null,"Yes","Yes","No"]
{"$rows_left_out":272}
{"sheet":"data","index":11,"n_rows":46,"n_cols":10,"rows_kept":46,"cut":false,"hidden":true,"merged":[]}
[null,null,null,null,null,null,"Livestock","Nonspecialty","specialty","Value Loss"]
[]
[null,null,null,null,null,"Dairy","All Other Cattle","Barley, Malting","Almonds","Aquaculture"]
[null,null,null,null,null,null,"Feeder Cattle:  Less Than 600 Pounds","Canola","Apples","Floriculture"]
[null,null,null,null,null,null,"Feeder Cattle:  600 Pounds or More","Corn","Artichokes","Nursery"]
[null,null,null,null,null,null,"Slaughter Cattle: Fed Cattle","Cotton, Upland","ASPARAGUS"]
{"$rows_left_out":40}